{"text_format":"1","workbook":"xlsx","n_sheets":6,"sheets":["Berechnungsblatt","Gemeindeliste","Grundlagedaten_2014","Grundlagedaten_2023","Medianwerte","BS_HR"],"not_rendered":{"charts":0,"images":5,"macros":1,"external_links":0,"defined_names":3,"comments":0,"pivot_tables":0},"unopened":[],"bounds":{"document_bytes":16777216,"sheet_cells":100000,"rows_first":2000,"rows_last":500,"rows_between":2000,"halvings":0,"cell_chars":16384,"cell_head_chars":4096},"cells_cut":0,"cells_raw":0,"read":"whole","date_system":"1900"}

{"sheet":"Berechnungsblatt","index":0,"n_rows":54,"n_cols":22,"rows_kept":54,"cut":false,"hidden":false,"merged":[[13,0,13,6],[27,0,27,6],[20,3,20,4],[21,3,21,4],[11,5,11,6],[15,10,15,13],[29,8,30,8],[29,9,30,10],[29,12,30,13],[41,5,41,6],[34,3,34,4],[35,3,35,4],[41,9,41,10],[41,12,41,13],[49,8,51,8],[49,9,51,10],[49,12,51,13],[44,3,44,4],[44,16,44,19],[25,10,25,13],[26,10,26,13],[27,10,27,13],[16,10,16,13],[17,10,17,13],[45,3,45,4],[60,22,60,24],[1,0,1,6],[3,1,3,3],[11,3,11,4],[14,3,14,4],[15,3,15,4],[24,3,24,4],[29,3,29,4],[28,3,28,4],[5,8,6,13],[41,3,41,4],[18,3,18,4],[19,3,19,4],[11,12,11,13],[36,3,36,4],[30,3,30,4],[9,8,10,13],[33,3,33,4],[25,3,25,4],[19,8,21,8],[19,9,21,10],[19,12,21,13],[32,0,32,6],[11,9,11,10],[23,0,23,6],[52,86,52,89],[52,91,52,94],[52,96,52,99],[52,101,52,104],[52,106,52,109],[52,61,52,64],[52,66,52,69],[52,71,52,74],[52,76,52,79],[52,81,52,84],[52,36,52,39],[52,41,52,44],[52,46,52,49],[52,51,52,54],[52,56,52,59],[45,16,45,19],[52,21,52,24],[52,26,52,29],[52,31,52,34],[52,186,52,189],[52,191,52,194],[52,196,52,199],[52,201,52,204],[52,206,52,209],[52,161,52,164],[52,166,52,169],[52,171,52,174],[52,176,52,179],[52,181,52,184],[52,136,52,139],[52,141,52,144],[52,146,52,149],[52,151,52,154],[52,156,52,159],[52,111,52,114],[52,116,52,119],[52,121,52,124],[52,126,52,129],[52,131,52,134],[52,286,52,289],[52,291,52,294],[52,296,52,299],[52,301,52,304],[52,306,52,309],[52,261,52,264],[52,266,52,269],[52,271,52,274],[52,276,52,279],[52,281,52,284],[52,236,52,239],[52,241,52,244],[52,246,52,249],[52,251,52,254],[52,256,52,259],[52,211,52,214],[52,216,52,219],[52,221,52,224],[52,226,52,229],[52,231,52,234],[52,386,52,389],[52,391,52,394],[52,396,52,399],[52,401,52,404],[52,406,52,409],[52,361,52,364],[52,366,52,369],[52,371,52,374],[52,376,52,379],[52,381,52,384],[52,336,52,339],[52,341,52,344],[52,346,52,349],[52,351,52,354],[52,356,52,359],[52,311,52,314],[52,316,52,319],[52,321,52,324],[52,326,52,329],[52,331,52,334],[52,486,52,489],[52,491,52,494],[52,496,52,499],[52,501,52,504],[52,506,52,509],[52,461,52,464],[52,466,52,469],[52,471,52,474],[52,476,52,479],[52,481,52,484],[52,436,52,439],[52,441,52,444],[52,446,52,449],[52,451,52,454],[52,456,52,459],[52,411,52,414],[52,416,52,419],[52,421,52,424],[52,426,52,429],[52,431,52,434],[52,586,52,589],[52,591,52,594],[52,596,52,599],[52,601,52,604],[52,606,52,609],[52,561,52,564],[52,566,52,569],[52,571,52,574],[52,576,52,579],[52,581,52,584],[52,536,52,539],[52,541,52,544],[52,546,52,549],[52,551,52,554],[52,556,52,559],[52,511,52,514],[52,516,52,519],[52,521,52,524],[52,526,52,529],[52,531,52,534],[52,686,52,689],[52,691,52,694],[52,696,52,699],[52,701,52,704],[52,706,52,709],[52,661,52,664],[52,666,52,669],[52,671,52,674],[52,676,52,679],[52,681,52,684],[52,636,52,639],[52,641,52,644],[52,646,52,649],[52,651,52,654],[52,656,52,659],[52,611,52,614],[52,616,52,619],[52,621,52,624],[52,626,52,629],[52,631,52,634],[52,786,52,789],[52,791,52,794],[52,796,52,799],[52,801,52,804],[52,806,52,809],[52,761,52,764],[52,766,52,769],[52,771,52,774],[52,776,52,779],[52,781,52,784],[52,736,52,739],[52,741,52,744],[52,746,52,749],[52,751,52,754],[52,756,52,759],[52,711,52,714],[52,716,52,719],[52,721,52,724],[52,726,52,729],[52,731,52,734],[52,886,52,889],[52,891,52,894],[52,896,52,899],[52,901,52,904],[52,906,52,909],[52,861,52,864],[52,866,52,869],[52,871,52,874],[52,876,52,879],[52,881,52,884],[52,836,52,839],[52,841,52,844],[52,846,52,849],[52,851,52,854],[52,856,52,859],[52,811,52,814],[52,816,52,819],[52,821,52,824],[52,826,52,829],[52,831,52,834],[52,986,52,989],[52,991,52,994],[52,996,52,999],[52,1001,52,1004],[52,1006,52,1009],[52,961,52,964],[52,966,52,969],[52,971,52,974],[52,976,52,979],[52,981,52,984],[52,936,52,939],[52,941,52,944],[52,946,52,949],[52,951,52,954],[52,956,52,959],[52,911,52,914],[52,916,52,919],[52,921,52,924],[52,926,52,929],[52,931,52,934],[52,1086,52,1089],[52,1091,52,1094],[52,1096,52,1099],[52,1101,52,1104],[52,1106,52,1109],[52,1061,52,1064],[52,1066,52,1069],[52,1071,52,1074],[52,1076,52,1079],[52,1081,52,1084],[52,1036,52,1039],[52,1041,52,1044],[52,1046,52,1049],[52,1051,52,1054],[52,1056,52,1059],[52,1011,52,1014],[52,1016,52,1019],[52,1021,52,1024],[52,1026,52,1029],[52,1031,52,1034],[52,1186,52,1189],[52,1191,52,1194],[52,1196,52,1199],[52,1201,52,1204],[52,1206,52,1209],[52,1161,52,1164],[52,1166,52,1169],[52,1171,52,1174],[52,1176,52,1179],[52,1181,52,1184],[52,1136,52,1139],[52,1141,52,1144],[52,1146,52,1149],[52,1151,52,1154],[52,1156,52,1159],[52,1111,52,1114],[52,1116,52,1119],[52,1121,52,1124],[52,1126,52,1129],[52,1131,52,1134],[52,1286,52,1289],[52,1291,52,1294],[52,1296,52,1299],[52,1301,52,1304],[52,1306,52,1309],[52,1261,52,1264],[52,1266,52,1269],[52,1271,52,1274],[52,1276,52,1279],[52,1281,52,1284],[52,1236,52,1239],[52,1241,52,1244],[52,1246,52,1249],[52,1251,52,1254],[52,1256,52,1259],[52,1211,52,1214],[52,1216,52,1219],[52,1221,52,1224],[52,1226,52,1229],[52,1231,52,1234],[52,1386,52,1389],[52,1391,52,1394],[52,1396,52,1399],[52,1401,52,1404],[52,1406,52,1409],[52,1361,52,1364],[52,1366,52,1369],[52,1371,52,1374],[52,1376,52,1379],[52,1381,52,1384],[52,1336,52,1339],[52,1341,52,1344],[52,1346,52,1349],[52,1351,52,1354],[52,1356,52,1359],[52,1311,52,1314],[52,1316,52,1319],[52,1321,52,1324],[52,1326,52,1329],[52,1331,52,1334],[52,1486,52,1489],[52,1491,52,1494],[52,1496,52,1499],[52,1501,52,1504],[52,1506,52,1509],[52,1461,52,1464],[52,1466,52,1469],[52,1471,52,1474],[52,1476,52,1479],[52,1481,52,1484],[52,1436,52,1439],[52,1441,52,1444],[52,1446,52,1449],[52,1451,52,1454],[52,1456,52,1459],[52,1411,52,1414],[52,1416,52,1419],[52,1421,52,1424],[52,1426,52,1429],[52,1431,52,1434],[52,1586,52,1589],[52,1591,52,1594],[52,1596,52,1599],[52,1601,52,1604],[52,1606,52,1609],[52,1561,52,1564],[52,1566,52,1569],[52,1571,52,1574],[52,1576,52,1579],[52,1581,52,1584],[52,1536,52,1539],[52,1541,52,1544],[52,1546,52,1549],[52,1551,52,1554],[52,1556,52,1559],[52,1511,52,1514],[52,1516,52,1519],[52,1521,52,1524],[52,1526,52,1529],[52,1531,52,1534],[52,1686,52,1689],[52,1691,52,1694],[52,1696,52,1699],[52,1701,52,1704],[52,1706,52,1709],[52,1661,52,1664],[52,1666,52,1669],[52,1671,52,1674],[52,1676,52,1679],[52,1681,52,1684],[52,1636,52,1639],[52,1641,52,1644],[52,1646,52,1649],[52,1651,52,1654],[52,1656,52,1659],[52,1611,52,1614],[52,1616,52,1619],[52,1621,52,1624],[52,1626,52,1629],[52,1631,52,1634],[52,1786,52,1789],[52,1791,52,1794],[52,1796,52,1799],[52,1801,52,1804],[52,1806,52,1809],[52,1761,52,1764],[52,1766,52,1769],[52,1771,52,1774],[52,1776,52,1779],[52,1781,52,1784],[52,1736,52,1739],[52,1741,52,1744],[52,1746,52,1749],[52,1751,52,1754],[52,1756,52,1759],[52,1711,52,1714],[52,1716,52,1719],[52,1721,52,1724],[52,1726,52,1729],[52,1731,52,1734],[52,1886,52,1889],[52,1891,52,1894],[52,1896,52,1899],[52,1901,52,1904],[52,1906,52,1909],[52,1861,52,1864],[52,1866,52,1869],[52,1871,52,1874],[52,1876,52,1879],[52,1881,52,1884],[52,1836,52,1839],[52,1841,52,1844],[52,1846,52,1849],[52,1851,52,1854],[52,1856,52,1859],[52,1811,52,1814],[52,1816,52,1819],[52,1821,52,1824],[52,1826,52,1829],[52,1831,52,1834],[52,1986,52,1989],[52,1991,52,1994],[52,1996,52,1999],[52,2001,52,2004],[52,2006,52,2009],[52,1961,52,1964],[52,1966,52,1969],[52,1971,52,1974],[52,1976,52,1979],[52,1981,52,1984],[52,1936,52,1939],[52,1941,52,1944],[52,1946,52,1949],[52,1951,52,1954],[52,1956,52,1959],[52,1911,52,1914],[52,1916,52,1919],[52,1921,52,1924],[52,1926,52,1929],[52,1931,52,1934],[52,2086,52,2089],[52,2091,52,2094],[52,2096,52,2099],[52,2101,52,2104],[52,2106,52,2109],[52,2061,52,2064],[52,2066,52,2069],[52,2071,52,2074],[52,2076,52,2079],[52,2081,52,2084],[52,2036,52,2039],[52,2041,52,2044],[52,2046,52,2049],[52,2051,52,2054],[52,2056,52,2059],[52,2011,52,2014],[52,2016,52,2019],[52,2021,52,2024],[52,2026,52,2029],[52,2031,52,2034],[52,2186,52,2189],[52,2191,52,2194],[52,2196,52,2199],[52,2201,52,2204],[52,2206,52,2209],[52,2161,52,2164],[52,2166,52,2169],[52,2171,52,2174],[52,2176,52,2179],[52,2181,52,2184],[52,2136,52,2139],[52,2141,52,2144],[52,2146,52,2149],[52,2151,52,2154],[52,2156,52,2159],[52,2111,52,2114],[52,2116,52,2119],[52,2121,52,2124],[52,2126,52,2129],[52,2131,52,2134],[52,2286,52,2289],[52,2291,52,2294],[52,2296,52,2299],[52,2301,52,2304],[52,2306,52,2309],[52,2261,52,2264],[52,2266,52,2269],[52,2271,52,2274],[52,2276,52,2279],[52,2281,52,2284],[52,2236,52,2239],[52,2241,52,2244],[52,2246,52,2249],[52,2251,52,2254],[52,2256,52,2259],[52,2211,52,2214],[52,2216,52,2219],[52,2221,52,2224],[52,2226,52,2229],[52,2231,52,2234],[52,2386,52,2389],[52,2391,52,2394],[52,2396,52,2399],[52,2401,52,2404],[52,2406,52,2409],[52,2361,52,2364],[52,2366,52,2369],[52,2371,52,2374],[52,2376,52,2379],[52,2381,52,2384],[52,2336,52,2339],[52,2341,52,2344],[52,2346,52,2349],[52,2351,52,2354],[52,2356,52,2359],[52,2311,52,2314],[52,2316,52,2319],[52,2321,52,2324],[52,2326,52,2329],[52,2331,52,2334],[52,2486,52,2489],[52,2491,52,2494],[52,2496,52,2499],[52,2501,52,2504],[52,2506,52,2509],[52,2461,52,2464],[52,2466,52,2469],[52,2471,52,2474],[52,2476,52,2479],[52,2481,52,2484],[52,2436,52,2439],[52,2441,52,2444],[52,2446,52,2449],[52,2451,52,2454],[52,2456,52,2459],[52,2411,52,2414],[52,2416,52,2419],[52,2421,52,2424],[52,2426,52,2429],[52,2431,52,2434],[52,2586,52,2589],[52,2591,52,2594],[52,2596,52,2599],[52,2601,52,2604],[52,2606,52,2609],[52,2561,52,2564],[52,2566,52,2569],[52,2571,52,2574],[52,2576,52,2579],[52,2581,52,2584],[52,2536,52,2539],[52,2541,52,2544],[52,2546,52,2549],[52,2551,52,2554],[52,2556,52,2559],[52,2511,52,2514],[52,2516,52,2519],[52,2521,52,2524],[52,2526,52,2529],[52,2531,52,2534],[52,2686,52,2689],[52,2691,52,2694],[52,2696,52,2699],[52,2701,52,2704],[52,2706,52,2709],[52,2661,52,2664],[52,2666,52,2669],[52,2671,52,2674],[52,2676,52,2679],[52,2681,52,2684],[52,2636,52,2639],[52,2641,52,2644],[52,2646,52,2649],[52,2651,52,2654],[52,2656,52,2659],[52,2611,52,2614],[52,2616,52,2619],[52,2621,52,2624],[52,2626,52,2629],[52,2631,52,2634],[52,2786,52,2789],[52,2791,52,2794],[52,2796,52,2799],[52,2801,52,2804],[52,2806,52,2809],[52,2761,52,2764],[52,2766,52,2769],[52,2771,52,2774],[52,2776,52,2779],[52,2781,52,2784],[52,2736,52,2739],[52,2741,52,2744],[52,2746,52,2749],[52,2751,52,2754],[52,2756,52,2759],[52,2711,52,2714],[52,2716,52,2719],[52,2721,52,2724],[52,2726,52,2729],[52,2731,52,2734],[52,2886,52,2889],[52,2891,52,2894],[52,2896,52,2899],[52,2901,52,2904],[52,2906,52,2909],[52,2861,52,2864],[52,2866,52,2869],[52,2871,52,2874],[52,2876,52,2879],[52,2881,52,2884],[52,2836,52,2839],[52,2841,52,2844],[52,2846,52,2849],[52,2851,52,2854],[52,2856,52,2859],[52,2811,52,2814],[52,2816,52,2819],[52,2821,52,2824],[52,2826,52,2829],[52,2831,52,2834],[52,2986,52,2989],[52,2991,52,2994],[52,2996,52,2999],[52,3001,52,3004],[52,3006,52,3009],[52,2961,52,2964],[52,2966,52,2969],[52,2971,52,2974],[52,2976,52,2979],[52,2981,52,2984],[52,2936,52,2939],[52,2941,52,2944],[52,2946,52,2949],[52,2951,52,2954],[52,2956,52,2959],[52,2911,52,2914],[52,2916,52,2919],[52,2921,52,2924],[52,2926,52,2929],[52,2931,52,2934],[52,3086,52,3089],[52,3091,52,3094],[52,3096,52,3099],[52,3101,52,3104],[52,3106,52,3109],[52,3061,52,3064],[52,3066,52,3069],[52,3071,52,3074],[52,3076,52,3079],[52,3081,52,3084],[52,3036,52,3039],[52,3041,52,3044],[52,3046,52,3049],[52,3051,52,3054],[52,3056,52,3059],[52,3011,52,3014],[52,3016,52,3019],[52,3021,52,3024],[52,3026,52,3029],[52,3031,52,3034],[52,3186,52,3189],[52,3191,52,3194],[52,3196,52,3199],[52,3201,52,3204],[52,3206,52,3209],[52,3161,52,3164],[52,3166,52,3169],[52,3171,52,3174],[52,3176,52,3179],[52,3181,52,3184],[52,3136,52,3139],[52,3141,52,3144],[52,3146,52,3149],[52,3151,52,3154],[52,3156,52,3159],[52,3111,52,3114],[52,3116,52,3119],[52,3121,52,3124],[52,3126,52,3129],[52,3131,52,3134],[52,3286,52,3289],[52,3291,52,3294],[52,3296,52,3299],[52,3301,52,3304],[52,3306,52,3309],[52,3261,52,3264],[52,3266,52,3269],[52,3271,52,3274],[52,3276,52,3279],[52,3281,52,3284],[52,3236,52,3239],[52,3241,52,3244],[52,3246,52,3249],[52,3251,52,3254],[52,3256,52,3259],[52,3211,52,3214],[52,3216,52,3219],[52,3221,52,3224],[52,3226,52,3229],[52,3231,52,3234],[52,3386,52,3389],[52,3391,52,3394],[52,3396,52,3399],[52,3401,52,3404],[52,3406,52,3409],[52,3361,52,3364],[52,3366,52,3369],[52,3371,52,3374],[52,3376,52,3379],[52,3381,52,3384],[52,3336,52,3339],[52,3341,52,3344],[52,3346,52,3349],[52,3351,52,3354],[52,3356,52,3359],[52,3311,52,3314],[52,3316,52,3319],[52,3321,52,3324],[52,3326,52,3329],[52,3331,52,3334],[52,3486,52,3489],[52,3491,52,3494],[52,3496,52,3499],[52,3501,52,3504],[52,3506,52,3509],[52,3461,52,3464],[52,3466,52,3469],[52,3471,52,3474],[52,3476,52,3479],[52,3481,52,3484],[52,3436,52,3439],[52,3441,52,3444],[52,3446,52,3449],[52,3451,52,3454],[52,3456,52,3459],[52,3411,52,3414],[52,3416,52,3419],[52,3421,52,3424],[52,3426,52,3429],[52,3431,52,3434],[52,3586,52,3589],[52,3591,52,3594],[52,3596,52,3599],[52,3601,52,3604],[52,3606,52,3609],[52,3561,52,3564],[52,3566,52,3569],[52,3571,52,3574],[52,3576,52,3579],[52,3581,52,3584],[52,3536,52,3539],[52,3541,52,3544],[52,3546,52,3549],[52,3551,52,3554],[52,3556,52,3559],[52,3511,52,3514],[52,3516,52,3519],[52,3521,52,3524],[52,3526,52,3529],[52,3531,52,3534],[52,3686,52,3689],[52,3691,52,3694],[52,3696,52,3699],[52,3701,52,3704],[52,3706,52,3709],[52,3661,52,3664],[52,3666,52,3669],[52,3671,52,3674],[52,3676,52,3679],[52,3681,52,3684],[52,3636,52,3639],[52,3641,52,3644],[52,3646,52,3649],[52,3651,52,3654],[52,3656,52,3659],[52,3611,52,3614],[52,3616,52,3619],[52,3621,52,3624],[52,3626,52,3629],[52,3631,52,3634],[52,3786,52,3789],[52,3791,52,3794],[52,3796,52,3799],[52,3801,52,3804],[52,3806,52,3809],[52,3761,52,3764],[52,3766,52,3769],[52,3771,52,3774],[52,3776,52,3779],[52,3781,52,3784],[52,3736,52,3739],[52,3741,52,3744],[52,3746,52,3749],[52,3751,52,3754],[52,3756,52,3759],[52,3711,52,3714],[52,3716,52,3719],[52,3721,52,3724],[52,3726,52,3729],[52,3731,52,3734],[52,3886,52,3889],[52,3891,52,3894],[52,3896,52,3899],[52,3901,52,3904],[52,3906,52,3909],[52,3861,52,3864],[52,3866,52,3869],[52,3871,52,3874],[52,3876,52,3879],[52,3881,52,3884],[52,3836,52,3839],[52,3841,52,3844],[52,3846,52,3849],[52,3851,52,3854],[52,3856,52,3859],[52,3811,52,3814],[52,3816,52,3819],[52,3821,52,3824],[52,3826,52,3829],[52,3831,52,3834],[52,3986,52,3989],[52,3991,52,3994],[52,3996,52,3999],[52,4001,52,4004],[52,4006,52,4009],[52,3961,52,3964],[52,3966,52,3969],[52,3971,52,3974],[52,3976,52,3979],[52,3981,52,3984],[52,3936,52,3939],[52,3941,52,3944],[52,3946,52,3949],[52,3951,52,3954],[52,3956,52,3959],[52,3911,52,3914],[52,3916,52,3919],[52,3921,52,3924],[52,3926,52,3929],[52,3931,52,3934],[52,4086,52,4089],[52,4091,52,4094],[52,4096,52,4099],[52,4101,52,4104],[52,4106,52,4109],[52,4061,52,4064],[52,4066,52,4069],[52,4071,52,4074],[52,4076,52,4079],[52,4081,52,4084],[52,4036,52,4039],[52,4041,52,4044],[52,4046,52,4049],[52,4051,52,4054],[52,4056,52,4059],[52,4011,52,4014],[52,4016,52,4019],[52,4021,52,4024],[52,4026,52,4029],[52,4031,52,4034],[52,4186,52,4189],[52,4191,52,4194],[52,4196,52,4199],[52,4201,52,4204],[52,4206,52,4209],[52,4161,52,4164],[52,4166,52,4169],[52,4171,52,4174],[52,4176,52,4179],[52,4181,52,4184],[52,4136,52,4139],[52,4141,52,4144],[52,4146,52,4149],[52,4151,52,4154],[52,4156,52,4159],[52,4111,52,4114],[52,4116,52,4119],[52,4121,52,4124],[52,4126,52,4129],[52,4131,52,4134],[52,4286,52,4289],[52,4291,52,4294],[52,4296,52,4299],[52,4301,52,4304],[52,4306,52,4309],[52,4261,52,4264],[52,4266,52,4269],[52,4271,52,4274],[52,4276,52,4279],[52,4281,52,4284],[52,4236,52,4239],[52,4241,52,4244],[52,4246,52,4249],[52,4251,52,4254],[52,4256,52,4259],[52,4211,52,4214],[52,4216,52,4219],[52,4221,52,4224],[52,4226,52,4229],[52,4231,52,4234],[52,4386,52,4389],[52,4391,52,4394],[52,4396,52,4399],[52,4401,52,4404],[52,4406,52,4409],[52,4361,52,4364],[52,4366,52,4369],[52,4371,52,4374],[52,4376,52,4379],[52,4381,52,4384],[52,4336,52,4339],[52,4341,52,4344],[52,4346,52,4349],[52,4351,52,4354],[52,4356,52,4359],[52,4311,52,4314],[52,4316,52,4319],[52,4321,52,4324],[52,4326,52,4329],[52,4331,52,4334],[52,4486,52,4489],[52,4491,52,4494],[52,4496,52,4499],[52,4501,52,4504],[52,4506,52,4509],[52,4461,52,4464],[52,4466,52,4469],[52,4471,52,4474],[52,4476,52,4479],[52,4481,52,4484],[52,4436,52,4439],[52,4441,52,4444],[52,4446,52,4449],[52,4451,52,4454],[52,4456,52,4459],[52,4411,52,4414],[52,4416,52,4419],[52,4421,52,4424],[52,4426,52,4429],[52,4431,52,4434],[52,4586,52,4589],[52,4591,52,4594],[52,4596,52,4599],[52,4601,52,4604],[52,4606,52,4609],[52,4561,52,4564],[52,4566,52,4569],[52,4571,52,4574],[52,4576,52,4579],[52,4581,52,4584],[52,4536,52,4539],[52,4541,52,4544],[52,4546,52,4549],[52,4551,52,4554],[52,4556,52,4559],[52,4511,52,4514],[52,4516,52,4519],[52,4521,52,4524],[52,4526,52,4529],[52,4531,52,4534],[52,4686,52,4689],[52,4691,52,4694],[52,4696,52,4699],[52,4701,52,4704],[52,4706,52,4709],[52,4661,52,4664],[52,4666,52,4669],[52,4671,52,4674],[52,4676,52,4679],[52,4681,52,4684],[52,4636,52,4639],[52,4641,52,4644],[52,4646,52,4649],[52,4651,52,4654],[52,4656,52,4659],[52,4611,52,4614],[52,4616,52,4619],[52,4621,52,4624],[52,4626,52,4629],[52,4631,52,4634],[52,4786,52,4789],[52,4791,52,4794],[52,4796,52,4799],[52,4801,52,4804],[52,4806,52,4809],[52,4761,52,4764],[52,4766,52,4769],[52,4771,52,4774],[52,4776,52,4779],[52,4781,52,4784],[52,4736,52,4739]],"merged_total":6598,"flags":["merged_cut"]}
[]
["Datenblatt zur Berechnung der Bauzonengrösse nach Vorgaben der kantonalen Siedlungsstrategie 2014 / 2021 "]
[null,null,null,null,null,null,null,null,null,null,null,null,null,null,null,null,null,null,null,"BFS-Nummer",{"$f":"VLOOKUP($B$4,Gemeindeliste!A1:F107,2,FALSE)","v":2421}]
["Gemeinde:","Aedermannsdorf",null,null,"Handlungsraum:",null,null,null,"Hinweis für die Gemeinde:"]
[]
["Bezirk:",{"$f":"VLOOKUP($B$4,Gemeindeliste!$A$1:$F$107,3,FALSE)","v":"Thal"},null,null,{"$f":"V6","v":"ländlich"},null,null,null,{"$f":"IF(ISBLANK(VLOOKUP($B$4,Gemeindeliste!$A$1:$F$107,6,FALSE)),\"\",VLOOKUP($B$4,Gemeindeliste!$A$1:$F$107,6,FALSE))","v":""},null,null,null,null,null,null,null,null,null,null,"HR Raum",{"$f":"VLOOKUP($B$4,Gemeindeliste!$A$1:$F$107,4,FALSE)","v":"L"},{"$f":"IF($U$6=\"A\",\"agglogeprägt\",IF($U$6=\"U\",\"urban\",IF($U$6=\"L\",\"ländlich\",\"-\")))","v":"ländlich"}]
{"$rows_left_out":49}
{"sheet":"Gemeindeliste","index":1,"n_rows":107,"n_cols":6,"rows_kept":107,"cut":false,"hidden":true,"merged":[]}
["Aedermannsdorf",2421,"Thal","L","-"]
["Aeschi",2511,"Wasseramt","L","-","Keine Arbeitszone"]
["Balm bei Günsberg",2541,"Lebern","L","-","Keine Arbeitszone"]
["Balsthal",2422,"Thal","U","Regionalzentrum"]
["Bärschwil",2611,"Thierstein","L","-"]
["Bättwil",2471,"Dorneck","A","-"]
{"$rows_left_out":102}
{"sheet":"Grundlagedaten_2014","index":2,"n_rows":112,"n_cols":26,"rows_kept":112,"cut":false,"hidden":true,"merged":[]}
["BFS-Nummer","Gemeinde","Bezirk","HR","unbebaute WMZ","bebaute WMZ","unb/beb WMZ","Einwohner in WMZ","Beschäftige in WMZ","Summe EW+BS","Dichtewert WMZ (DWMZ)","Abweichung Dichtewert WMZ (AWMZ)","Dichtewert WMZ (EW)","Punb","Pb","Pbeb","Ptheo","Bev (2030)","BzB (2030)",null,"unbebaute AZ","bebaute AZ","unb/beb AZ","Dichtewert DAZ","Abweichung Dichtewert AAZ","Beschäftigte in AZ"]
[1,2,3,4,5,6,7,8,9,10,11,12,13,14,15,16,17,18,19,20,21,22,23,24,25,26]
[null,null,null,null,"[ha]","[ha]","[%]","[EW]","[BS]","[EW+BS]","[m2/(EW+BS)]","[%]","[m2/(EW)]","[EW]","[EW]","[EW]","[EW]","[EW]","[%]",null,"[ha]","[ha]","[%]","[m2/(BS)]","[%]","[BS]"]
[2421,"Aedermannsdorf","Thal","L",4.9400000000000004,15.19,0.32521395655036212,398,99,497,305.63380281690144,-0.19736308109427281,381.65829145728645,161.44623158316031,98.430821406519215,{"$f":"O4/3","v":32.810273802173072},592.25650538533341,468.73523675105594,0.79143957472630511,null,0,3.5700000000000003,0,1020,-1.2260753219051215]
[2511,"Aeschi","Wasseramt","L",4.6000000000000005,31.189999999999998,0.14748316768194938,1069,186.18545895010323,1255.1854589501031,248.48917566403932,2.6508971686240668E-2,291.76800748362956,157.65950625200387,0,{"$f":"O5/3","v":0},1226.6595062520039,1138.0419413065918,0.92775699817777579,null,0,0]
[2541,"Balm bei Günsberg","Lebern","L",1.41,6.51,0.21658986175115208,148,24,172,378.48837209302326,-0.48278102484348895,439.86486486486484,46.080806990335226,64.756066317079672,21.585355439026557,215.66616242936178,164.18033852536135,0.76127073749520702,null,0,0]
{"$rows_left_out":107}
{"sheet":"Grundlagedaten_2023","index":3,"n_rows":110,"n_cols":23,"rows_kept":110,"cut":false,"hidden":true,"merged":[]}
["BFS-Nummer","Gemeinde","Bezirk","HR","WMZ unbebaut","WMZ bebaut","unb/beb WMZ","Einwohner in WMZ","Beschäftige in WMZ","Summe EW+BS","Dichtewert WMZ (DWMZ)","Abweichung Dichtewert WMZ (AWMZ)","Dichtewert WMZ (EW)","Punb","Pb","Pbeb","Ptheo","Bev (2038)","BzB (2038)",null,"unbebaute AZ","bebaute AZ","unb/beb AZ"]
[1,2,3,4,5,6,7,8,9,10,11,12,13,14,15,16,17,18,19,20,21,22,23]
[null,null,null,null,"[ha]","[ha]","[%]","[EW]","[BS]","[EW+BS]","[m2/(EW+BS)]","[%]","[m2/(EW)]","[EW]","[EW]","[EW]","[EW]","[EW]","[%]",null,"[ha]","[ha]","[%]"]
[2421,"Aedermannsdorf","Thal","L",3.26,17.010000000000002,0.19165196942974719,457,57,514,255.3,-0.29625480665913773,355.46038543897214,106.18892508143321,97.071661237785065,73.716612377850197,595.54614549402822,457,0.76736287096762434,null,0,3.59,0]
[2511,"Aeschi","Wasseramt","L",3.85,33.28,0.11568509615384616,1204,109,1313,253.46534653465346,7.1862650424855401E-3,289.67297762478478,139.28485576923075,0,0,1343.2848557692307,1452.5799842395588,1.0813640740464838,null,0,0,0]
[2541,"Balm bei Günsberg","Lebern","L",0.86,7.05,0.12198581560283688,163,24,187,255.3,-0.47671503170224394,383.33333333333331,28.01302931596091,66.64169381107493,44.755700325732903,213.22692725298589,163,0.76444378812722147,null,0,1.01,0]
{"$rows_left_out":105}
{"sheet":"Medianwerte","index":4,"n_rows":22,"n_cols":2,"rows_kept":22,"cut":false,"hidden":true,"merged":[]}
["Flächenbeanspruchung WMZ pro Handlungsraum (ohne BS)"]
[null,"WMZ"]
[null,2]
["urban",184.08640070531192]
["agglogeprägt",249.71622045175917]
["ländlich",305.98422468940851]
{"$rows_left_out":17}
{"sheet":"BS_HR","index":5,"n_rows":24,"n_cols":2,"rows_kept":24,"cut":false,"hidden":true,"merged":[]}
["Handlungsraum"]
[1,2]
["urban","Im urbanen Raum erfolgt die Hauptentwicklung des Kantons. Er ist geprägt von attraktiven Zentrumsfunktionen, gut erschlossenen Arbeitsplatzgebieten und Wohnstandorten von hoher Qualität. Die Nutzungen sind stark durchmischt und die Erschliessung ist sehr gut. Die Siedlungen sind urban und dicht zu gestalten. Um eine hohe Siedlungsqualität zu erreichen, sind die Potenziale der Frei- und Grünräume innerhalb und ausserhalb der Siedlungen auszuschöpfen bzw. zu fördern."]
["agglogeprägt","Der agglomerationsgeprägte Raum grenzt an den urbanen Raum an. Er hat im Kanton Solothurn teilweise bereits ländlichen Charakter. Die Nutzungen sind grundsätzlich durchmischt, der Fokus liegt aber stärker beim Wohnen als beim Arbeiten. Die Verkehrserschliessung ist gut. Angesichts der guten Erreichbarkeit und der Zentrumsnähe sind Siedlungsverdichtungen oder -erweiterungen nach innen anzustreben und auf Standorte mit guter Anbindung an den öffentlichen Verkehr zu lenken. Der Erhöhung und Förderung der Siedlungsqualität kommt im agglomerationsgeprägten Raum besondere Bedeutung zu. Klare Siedlungsgrenzen sollen die Identität und räumliche Qualität erhöhen. Bestehende Freiräume sind vor Überbauung zu schützen und aufzuwerten."]
["ländlich","Der ländliche Raum zeichnet sich vor allem durch seine naturräumliche Vielfalt, Eigenart und Schönheit seiner Landschaften aus. Diese sind möglichst zu erhalten. Sie Siedlungsentwicklung als Wohn- und Arbeitsraum erfolgt gemässigt und ordnet sich in die Landschaft ein. Die Verkehrserschliessung ist auf tieferem Niveau als in den übrigen Räumen."]
["Stützpunktgemeinde","Den Stützpunktgemeinden im ländlichen Raum kommt mit dem Wohnungs- und Arbeitsplatzangebot sowie der Ausstattung für ihr Umland eine bedeutende Rolle zu. Sie sichern die Funktionsfähigkeit des ländlichen Raums und sollen sich angemessen weiterentwickeln, insbesondere in Bezug auf Versorgungseinrichtungen zur Deckung des täglichen Bedarfs, der lokalen Freizeiteinrichtungen sowie der Infrastrukturen für ältere Menschen und Familien."]
{"$rows_left_out":18}